BDBM468629 1-(2-((2S,4R)-2-(2'- chloro-2- fluorobiphenyl-3- ylcarbamoyl)-4- fluoropyrrolidin-1- yl)-2-oxoethyl)-5- (trifluoromethyl)- 1H-thieno[3,2- c]pyrazole-3- carboxamide::US10807952, Cmp No. 33
SMILES NC(=O)c1nn(CC(=O)N2C[C@H](F)C[C@H]2C(=O)Nc2cccc(c2F)-c2ccccc2Cl)c2cc(sc12)C(F)(F)F
InChI Key InChIKey=OSGABWHPMQSUKD-XIKOKIGWSA-N
Data  1 IC50
  Tab Delimited (TSV)   2D SDfile   Computed 3D by Vconf -m prep SDfile
Find this compound or compounds like it in BindingDB:
Activity Spreadsheet -- Enzyme Inhibition Constant Data from BindingDB
Found 1 hit for monomerid = 468629
TargetComplement factor D(Homo sapiens (Human))
Achillion Pharmaceuticals
US Patent
LigandPNGBDBM468629(1-(2-((2S,4R)-2-(2'- chloro-2- fluorobiphenyl-3- y...)
Affinity DataIC50: <1.00E+3nM. Assay description: TBD
Ligand InfoPC cidPC sid
In DepthDetails US Patent