BDBM468647 US10807952, Cmp No. 51::tert-butyl 2-(3'- ((2S,4R)-1-(2-(3- carbamoyl-1H- indazol-1- yl)acetyl)-4- fluoropyrrolidine-2- carboxamido)-6- chloro-2'- fluorobiphenyl-3- yl)-2- oxoethylcarbamate
SMILES CC(C)(C)OC(=O)NCC(=O)c1ccc(Cl)c(c1)-c1cccc(NC(=O)[C@@H]2C[C@@H](F)CN2C(=O)Cn2nc(C(N)=O)c3ccccc23)c1F
InChI Key InChIKey=SLIVWYOGTDEIBR-BCHFMIIMSA-N
Data  1 IC50
  Tab Delimited (TSV)   2D SDfile   Computed 3D by Vconf -m prep SDfile
Find this compound or compounds like it in BindingDB:
Activity Spreadsheet -- Enzyme Inhibition Constant Data from BindingDB
Found 1 hit for monomerid = 468647
TargetComplement factor D(Homo sapiens (Human))
Achillion Pharmaceuticals
US Patent
LigandPNGBDBM468647(US10807952, Cmp No. 51 | tert-butyl 2-(3'- ((2S,4R...)
Affinity DataIC50: <1.00E+3nM. Assay description: TBD
Ligand InfoPC cidPC sid
In DepthDetails US Patent