BDBM468649 1-(2-((2S,4R)-2-(3- (benzo[d]thiazol-6- yl)-2- fluorophenyl- carbamoyl)-4- fluoropyrrolidin-1- yl)-2-oxoethyl)-1H- indazole-3- carboxamide::US10807952, Cmp No. 53
SMILES NC(=O)c1nn(CC(=O)N2C[C@H](F)C[C@H]2C(=O)Nc2cccc(c2F)-c2ccc3ncsc3c2)c2ccccc12
InChI Key InChIKey=HSSFWKANYWTKNG-ZHRRBRCNSA-N
Data  1 IC50
  Tab Delimited (TSV)   2D SDfile   Computed 3D by Vconf -m prep SDfile
Find this compound or compounds like it in BindingDB:
Activity Spreadsheet -- Enzyme Inhibition Constant Data from BindingDB
Found 1 hit for monomerid = 468649
TargetComplement factor D(Homo sapiens (Human))
Achillion Pharmaceuticals
US Patent
LigandPNGBDBM468649(1-(2-((2S,4R)-2-(3- (benzo[d]thiazol-6- yl)-2- flu...)
Affinity DataIC50: <1.00E+3nM. Assay description: TBD
Ligand InfoPC cidPC sid
In DepthDetails US Patent