BDBM468654 5-(2-((2S,4R)-2-(2'- chloro-2- fluorobiphenyl-3- ylcarbamoyl)-4- fluoropyrrolidin-1- yl)-2-oxoethyl)-5H- imidazo[1,2- b]pyrazole-7- carboxamide::US10807952, Cmp No. 58
SMILES NC(=O)c1cn(CC(=O)N2C[C@H](F)C[C@H]2C(=O)Nc2cccc(c2F)-c2ccccc2Cl)n2ccnc12
InChI Key InChIKey=XJVGZYSQZOXOCQ-VLIAUNLRSA-N
Data  1 IC50
  Tab Delimited (TSV)   2D SDfile   Computed 3D by Vconf -m prep SDfile
Find this compound or compounds like it in BindingDB:
Activity Spreadsheet -- Enzyme Inhibition Constant Data from BindingDB
Found 1 hit for monomerid = 468654
TargetComplement factor D(Homo sapiens (Human))
Achillion Pharmaceuticals
US Patent
LigandPNGBDBM468654(5-(2-((2S,4R)-2-(2'- chloro-2- fluorobiphenyl-3- y...)
Affinity DataIC50:  5.50E+3nM. Assay description: TBD
Ligand InfoPC cidPC sid
In DepthDetails US Patent