BDBM468667 (2S,4R)-1-(2-(3- carbamimidoyl-5- methyl-1H- thieno[3,2- c]pyrazol-1- yl)acetyl)-N-(2'- chloro-2- fluorobiphenyl-3- yl)-4- fluoropyrrolidine-2- carboxamide::US10807952, Cmp No. 73
SMILES Cc1cc2n(CC(=O)N3C[C@H](F)C[C@H]3C(=O)Nc3cccc(c3F)-c3ccccc3Cl)nc(C(N)=N)c2s1
InChI Key InChIKey=APWISKSEBJFEOB-VLIAUNLRSA-N
Data  1 IC50
  Tab Delimited (TSV)   2D SDfile   Computed 3D by Vconf -m prep SDfile
Find this compound or compounds like it in BindingDB:
Activity Spreadsheet -- Enzyme Inhibition Constant Data from BindingDB
Found 1 hit for monomerid = 468667
TargetComplement factor D(Homo sapiens (Human))
Achillion Pharmaceuticals
US Patent
LigandPNGBDBM468667((2S,4R)-1-(2-(3- carbamimidoyl-5- methyl-1H- thien...)
Affinity DataIC50: <1.00E+3nM. Assay description: TBD
Ligand InfoPC cidPC sid
In DepthDetails US Patent