BDBM468673 6-(3-((2S,4R)-1-(2- (3-acetyl-1H- indazol-1- yl)acetyl)-4- fluoropyrrolidine-2- carboxamido)-2- fluorophenyl)-1H- benzo[d]imidazole- 4-carboxylic acid::US10807952, Cmp No. 80
SMILES CC(=O)c1nn(CC(=O)N2C[C@H](F)C[C@H]2C(=O)Nc2cccc(c2F)-c2cc(C(O)=O)c3nc[nH]c3c2)c2ccccc12
InChI Key
Data  1 IC50
  Tab Delimited (TSV)   2D SDfile   Computed 3D by Vconf -m prep SDfile
Find this compound or compounds like it in BindingDB:
Activity Spreadsheet -- Enzyme Inhibition Constant Data from BindingDB
Found 1 hit for monomerid = 468673
TargetComplement factor D(Homo sapiens (Human))
Achillion Pharmaceuticals
US Patent
LigandPNGBDBM468673(6-(3-((2S,4R)-1-(2- (3-acetyl-1H- indazol-1- yl)ac...)
Affinity DataIC50: <1.00E+3nM. Assay description: TBD
Ligand InfoPC cidPC sid
In DepthDetails US Patent