BDBM468792 US10807959, Example 62
SMILES COc1cc(CNC(=O)c2cc(CNC3=NCCC3)cc(c2)-c2cc(C)c(F)cc2C)cc(OC)c1
InChI Key InChIKey=NMIDLMMZIULQKW-UHFFFAOYSA-N
Data  1 KI
  Tab Delimited (TSV)   2D SDfile   Computed 3D by Vconf -m prep SDfile
Find this compound or compounds like it in BindingDB:
Activity Spreadsheet -- Enzyme Inhibition Constant Data from BindingDB
Found 1 hit for monomerid = 468792
TargetWD repeat-containing protein 5(Homo sapiens (Human))
Vanderbilt University
US Patent
LigandPNGBDBM468792(US10807959, Example 62)
Affinity DataKi:  0.210nM. Assay description: A Time-Resolved Fluorescence Resonance Energy Transfer (TR-FRET) assay that measures the displacement of the 10mer-Thr-FAM probe in response to compo...
Ligand InfoPC cidPC sid
In DepthDetails US Patent