BDBM468814 US10807959, Example 84
SMILES Cc1cnccc1-c1cc(CNC2=NCCN2)cc(n1)C(=O)NCc1ccc(Cl)c(Cl)c1
InChI Key InChIKey=RSPUYJLFVANDQW-UHFFFAOYSA-N
Data  1 KI
  Tab Delimited (TSV)   2D SDfile   Computed 3D by Vconf -m prep SDfile
Find this compound or compounds like it in BindingDB:
Activity Spreadsheet -- Enzyme Inhibition Constant Data from BindingDB
Found 1 hit for monomerid = 468814
TargetWD repeat-containing protein 5(Homo sapiens (Human))
Vanderbilt University
US Patent
LigandPNGBDBM468814(US10807959, Example 84)
Affinity DataKi:  0.150nM. Assay description: A Time-Resolved Fluorescence Resonance Energy Transfer (TR-FRET) assay that measures the displacement of the 10mer-Thr-FAM probe in response to compo...
Ligand InfoPC cidPC sid
In DepthDetails US Patent