BDBM468925 US10807959, Example B64
SMILES Cc1nc(F)ccc1-c1cc(CNC2=NCCN2)cc(c1)C(=O)NCc1ccc(Cl)c(Cl)c1
InChI Key InChIKey=RQCCOXNZCYISHV-UHFFFAOYSA-N
Data  1 KI
  Tab Delimited (TSV)   2D SDfile   Computed 3D by Vconf -m prep SDfile
Find this compound or compounds like it in BindingDB:
Activity Spreadsheet -- Enzyme Inhibition Constant Data from BindingDB
Found 1 hit for monomerid = 468925
TargetWD repeat-containing protein 5(Homo sapiens (Human))
Vanderbilt University
US Patent
LigandPNGBDBM468925(US10807959, Example B64)
Affinity DataKi:  0.0210nM. Assay description: FPA Assay protocol adopted from Karatas et al. (J. Med. Chem. 2010, 5179.; J. Amer. Chem. Soc. 2013, 669.): WDR5 (Δ23, residues 24-334), is expr...
Ligand InfoPC cidPC sid
In DepthDetails US Patent