BDBM468933 US10807959, Example B90
SMILES Cc1cc(C)cc(CNC(=O)c2cc(CNC3=NCCN3)cc(c2)-c2ccnc(C)c2)c1
InChI Key InChIKey=VGFXTXQXAQWYHT-UHFFFAOYSA-N
Data  1 KI
  Tab Delimited (TSV)   2D SDfile   Computed 3D by Vconf -m prep SDfile
Find this compound or compounds like it in BindingDB:
Activity Spreadsheet -- Enzyme Inhibition Constant Data from BindingDB
Found 1 hit for monomerid = 468933
TargetWD repeat-containing protein 5(Homo sapiens (Human))
Vanderbilt University
US Patent
LigandPNGBDBM468933(US10807959, Example B90)
Affinity DataKi:  0.115nM. Assay description: FPA Assay protocol adopted from Karatas et al. (J. Med. Chem. 2010, 5179.; J. Amer. Chem. Soc. 2013, 669.): WDR5 (Δ23, residues 24-334), is expr...
Ligand InfoPC cidPC sid
In DepthDetails US Patent