BDBM468938 US10807959, Example B109
SMILES COc1cc(CNC(=O)c2cc(CNC3=NCCN3)cc(c2)-c2cc(C)cnc2F)cc(OC)c1
InChI Key InChIKey=LGWORMOAOLQTNI-UHFFFAOYSA-N
Data  1 KI
  Tab Delimited (TSV)   2D SDfile   Computed 3D by Vconf -m prep SDfile
Find this compound or compounds like it in BindingDB:
Activity Spreadsheet -- Enzyme Inhibition Constant Data from BindingDB
Found 1 hit for monomerid = 468938
TargetWD repeat-containing protein 5(Homo sapiens (Human))
Vanderbilt University
US Patent
LigandPNGBDBM468938(US10807959, Example B109)
Affinity DataKi:  0.0380nM. Assay description: FPA Assay protocol adopted from Karatas et al. (J. Med. Chem. 2010, 5179.; J. Amer. Chem. Soc. 2013, 669.): WDR5 (Δ23, residues 24-334), is expr...
Ligand InfoPC cidPC sid
In DepthDetails US Patent