BDBM469108 US10807974, Example 127::US10995088, Example 127::US11608330, Example 127
SMILES CS(=O)(=O)c1cc(cc(c1)S(=O)(=O)c1ccc(CN)s1)-c1cn[nH]c1
InChI Key InChIKey=MMUCXFDHUJKQEA-UHFFFAOYSA-N
Data  3 IC50
  Tab Delimited (TSV)   2D SDfile   Computed 3D by Vconf -m prep SDfile
Find this compound or compounds like it in BindingDB:
Activity Spreadsheet -- Enzyme Inhibition Constant Data from BindingDB
Found 3 hits for monomerid = 469108
TargetLysyl oxidase homolog 2(Homo sapiens (Human))
The Institute Of Cancer Research: Royal Cancer Hospital
US Patent
LigandPNGBDBM469108(US10807974, Example 127 | US10995088, Example 127 ...)
Affinity DataIC50:  180nM. Assay description: LOXL2 batch is obtained from R&D systems/Bio-techne. Incubate for 1 hour at room temp on a plate shaker.
Ligand InfoPC cidPC sid
In DepthDetails US Patent
TargetLysyl oxidase homolog 2(Homo sapiens (Human))
The Institute Of Cancer Research: Royal Cancer Hospital
US Patent
LigandPNGBDBM469108(US10807974, Example 127 | US10995088, Example 127 ...)
Affinity DataIC50:  180nM
Ligand InfoPC cidPC sid
In DepthDetails US Patent
TargetLysyl oxidase homolog 2(Homo sapiens (Human))
The Institute Of Cancer Research: Royal Cancer Hospital
US Patent
LigandPNGBDBM469108(US10807974, Example 127 | US10995088, Example 127 ...)
Affinity DataIC50:  180nM. Assay description: 10. Incubate for 1 hr at room temp on a plate shaker, protected from light.
Ligand InfoPC cidPC sid
In DepthDetails US Patent