BDBM469155 N-[6-(1,5-dimethyl-6-oxopyridin-3-yl)-1-[(3- fluorophenyl)methyl]-2-methylbenzimidazol-4- yl]methanesulfonamide::US10807982, Example 35
SMILES Cc1nc2c(NS(C)(=O)=O)cc(cc2n1Cc1cccc(F)c1)-c1cc(C)c(=O)n(C)c1
InChI Key InChIKey=KLMMBPFCSXLQIN-UHFFFAOYSA-N
Data  1 IC50
  Tab Delimited (TSV)   2D SDfile   Computed 3D by Vconf -m prep SDfile
Find this compound or compounds like it in BindingDB:
Activity Spreadsheet -- Enzyme Inhibition Constant Data from BindingDB
Found 1 hit for monomerid = 469155
TargetBromodomain-containing protein 4(Homo sapiens (Human))
Celgene Quanticel Research
US Patent
LigandPNGBDBM469155(N-[6-(1,5-dimethyl-6-oxopyridin-3-yl)-1-[(3- fluor...)
Affinity DataIC50: <500nM. Assay description: Determination of the IC50 for the heterocyclic derivative BRD4 inhibitors disclosed herein was performed as follows. His-tagged BREM was cloned, expr...
Ligand InfoPC cidPC sid
In DepthDetails US Patent