BDBM469175 N-[2-cyclopropyl-3-methyl-7-(2-methyl-1- oxoisoquinolin-4-yl)benzimidazol-5- yl]ethanesulfonamide::US10807982, Example 55
SMILES CCS(=O)(=O)Nc1cc(-c2cn(C)c(=O)c3ccccc23)c2nc(C3CC3)n(C)c2c1
InChI Key InChIKey=USCXTHQXBKFRGG-UHFFFAOYSA-N
Data  1 IC50
  Tab Delimited (TSV)   2D SDfile   Computed 3D by Vconf -m prep SDfile
Find this compound or compounds like it in BindingDB:
Activity Spreadsheet -- Enzyme Inhibition Constant Data from BindingDB
Found 1 hit for monomerid = 469175
TargetBromodomain-containing protein 4(Homo sapiens (Human))
Celgene Quanticel Research
US Patent
LigandPNGBDBM469175(N-[2-cyclopropyl-3-methyl-7-(2-methyl-1- oxoisoqui...)
Affinity DataIC50: <500nM. Assay description: Determination of the IC50 for the heterocyclic derivative BRD4 inhibitors disclosed herein was performed as follows. His-tagged BREM was cloned, expr...
Ligand InfoPC cidPC sid
In DepthDetails US Patent