BDBM469184 N-[6-(1,5-dimethyl-6-oxopyridin-3-yl)-3-fluoro-1- [(4-fluorophenyl)methyl]indazol-4- yl]methanesulfonamide::US10807982, Example 64
SMILES Cc1cc(cn(C)c1=O)-c1cc(NS(C)(=O)=O)c2c(F)nn(Cc3ccc(F)cc3)c2c1
InChI Key InChIKey=SJBKAERHWYOJOP-UHFFFAOYSA-N
Data  1 IC50
  Tab Delimited (TSV)   2D SDfile   Computed 3D by Vconf -m prep SDfile
Find this compound or compounds like it in BindingDB:
Activity Spreadsheet -- Enzyme Inhibition Constant Data from BindingDB
Found 1 hit for monomerid = 469184
TargetBromodomain-containing protein 4(Homo sapiens (Human))
Celgene Quanticel Research
US Patent
LigandPNGBDBM469184(N-[6-(1,5-dimethyl-6-oxopyridin-3-yl)-3-fluoro-1- ...)
Affinity DataIC50: <500nM. Assay description: Determination of the IC50 for the heterocyclic derivative BRD4 inhibitors disclosed herein was performed as follows. His-tagged BREM was cloned, expr...
Ligand InfoPC cidPC sid
In DepthDetails US Patent