BDBM469243 US10807985, Compound 18
SMILES COc1ccc(cc1)-c1cc2c(ncnn2c1)N1CCN(CC1)c1ncc(Cc2ccccc2)cn1
InChI Key InChIKey=MUTDSMFDBHESKX-UHFFFAOYSA-N
Data  2 IC50
  Tab Delimited (TSV)   2D SDfile   Computed 3D by Vconf -m prep SDfile
Find this compound or compounds like it in BindingDB:
Activity Spreadsheet -- Enzyme Inhibition Constant Data from BindingDB
Found 2 hits for monomerid = 469243
TargetPlatelet-derived growth factor receptor alpha [D842V](Homo sapiens (Human))
Blueprint Medicines
US Patent
LigandPNGBDBM469243(US10807985, Compound 18)
Affinity DataIC50:  55nM. Assay description: In each well of a 384-well plate, 0.7 ng/ul (8 nM) of PDGFRA D842V (ProQinase 0761-0000-1) was incubated in a total of 12.5 ul of buffer (100 mM HEPE...
Ligand InfoPC cidPC sid
In DepthDetails US Patent
TargetMast/stem cell growth factor receptor Kit [D816V](Homo sapiens (Human))
Blueprint Medicines
US Patent
LigandPNGBDBM469243(US10807985, Compound 18)
Affinity DataIC50:  55nM. Assay description: In each well of a 384-well plate, 0.04 ng/ul (0.5 nM) of D816V KIT (Carna Bioscience 08-156) was incubated in a total of 12.5 ul of buffer (100 mM HE...
Ligand InfoPC cidPC sid
In DepthDetails US Patent