BDBM469296 US10807985, Compound 71
SMILES Cc1nn(C)cc1-c1cc2c(ncnn2c1)N1CCN(CC1)c1ncc(cn1)[C@](C)(O)c1ccc(F)cc1
InChI Key InChIKey=SMVFHSLHOHTTLE-HHHXNRCGSA-N
Data  1 IC50
  Tab Delimited (TSV)   2D SDfile   Computed 3D by Vconf -m prep SDfile
Find this compound or compounds like it in BindingDB:
Activity Spreadsheet -- Enzyme Inhibition Constant Data from BindingDB
Found 1 hit for monomerid = 469296
TargetMast/stem cell growth factor receptor Kit [D816V](Homo sapiens (Human))
Blueprint Medicines
US Patent
LigandPNGBDBM469296(US10807985, Compound 71)
Affinity DataIC50:  5.5nM. Assay description: In each well of a 384-well plate, 0.04 ng/ul (0.5 nM) of D816V KIT (Carna Bioscience 08-156) was incubated in a total of 12.5 ul of buffer (100 mM HE...
Ligand InfoPC cidPC sid
In DepthDetails US Patent