BDBM469305 US10807985, Compound 80
SMILES Cc1cc(F)ccc1[C@](C)(O)c1cnc(nc1)N1CCN(CC1)c1ncnn2cc(cc12)-c1cnn(C)c1
InChI Key InChIKey=YHHGBLOVDKWUKF-HHHXNRCGSA-N
Data  1 IC50
  Tab Delimited (TSV)   2D SDfile   Computed 3D by Vconf -m prep SDfile
Find this compound or compounds like it in BindingDB:
Activity Spreadsheet -- Enzyme Inhibition Constant Data from BindingDB
Found 1 hit for monomerid = 469305
TargetMast/stem cell growth factor receptor Kit [D816V](Homo sapiens (Human))
Blueprint Medicines
US Patent
LigandPNGBDBM469305(US10807985, Compound 80)
Affinity DataIC50:  55nM. Assay description: In each well of a 384-well plate, 0.04 ng/ul (0.5 nM) of D816V KIT (Carna Bioscience 08-156) was incubated in a total of 12.5 ul of buffer (100 mM HE...
Ligand InfoPC cidPC sid
In DepthDetails US Patent