BDBM469398 US10807988, Example SC_3041::cis-5-[1-[(1-Cyano-cyclobutyl)-methyl]-8-dimethylamino-2-oxo-8-phenyl-1,3- diazaspiro[4.5]decan-3-yl]-pyrimidine-2-carbonitrile
SMILES CN(C)[C@]1(CC[C@]2(CN(C(=O)N2CC2(CCC2)C#N)c2cnc(nc2)C#N)CC1)c1ccccc1
InChI Key InChIKey=LQHPZKVUMILOJM-MKPDMIMOSA-N
Data  2 KI
  Tab Delimited (TSV)   2D SDfile   Computed 3D by Vconf -m prep SDfile
Find this compound or compounds like it in BindingDB:
Activity Spreadsheet -- Enzyme Inhibition Constant Data from BindingDB
Found 2 hits for monomerid = 469398
TargetNociceptin receptor(Homo sapiens (Human))
GrüNenthal
US Patent
LigandPNGBDBM469398(US10807988, Example SC_3041 | cis-5-[1-[(1-Cyano-c...)
Affinity DataKi:  0.900nM. Assay description: The hNOP receptor binding assay was performed as homogeneous SPA-assay (scintillation proximity assay) using the assay buffer 50 mM TRIS-HCl. 10 mM M...
Ligand InfoPC cidPC sid
In DepthDetails US Patent
TargetMu-type opioid receptor(Homo sapiens (Human))
GrüNenthal
US Patent
LigandPNGBDBM469398(US10807988, Example SC_3041 | cis-5-[1-[(1-Cyano-c...)
Affinity DataKi:  79.5nM. Assay description: The hMOP receptor binding assay was performed as homogeneous SPA-assay (scintillation proximity assay) using the assay buffer 50 mM TRIS-HCl (pH 7.4)...
Ligand InfoPC cidPC sid
In DepthDetails US Patent