BDBM469491 Compound 1-12::US11072585, Example 5
SMILES CCN[C@]1(CC[C@]2(CN(C(=O)N2)c2ccccc2C#N)CC1)c1ccccc1
InChI Key InChIKey=WSFPMDMXXIJPTJ-ZRZAMGCNSA-N
Data  1 IC50
  Tab Delimited (TSV)   2D SDfile   Computed 3D by Vconf -m prep SDfile
Find this compound or compounds like it in BindingDB:
Activity Spreadsheet -- Enzyme Inhibition Constant Data from BindingDB
Found 1 hit for monomerid = 469491
TargetLysyl oxidase homolog 2(Homo sapiens (Human))
Pharmakea
US Patent
LigandPNGBDBM469491(Compound 1-12 | US11072585, Example 5)
Affinity DataIC50: <300nM. Assay description: LOXL2 amine oxidase activity is evaluated by measuring Amplex Red fluorescence using 10-20× concentrated conditioned media from CHO cells stably expr...
Ligand InfoPC cidPC sid
In DepthDetails US Patent