BDBM46984 6-(4-methylphenyl)sulfonyl-6-azabicyclo[3.2.1]octane::6-[(4-methylphenyl)sulfonyl]-6-azabicyclo[3.2.1]octane::6-tosyl-6-azabicyclo[3.2.1]octane::MLS000850649::SMR000456666::cid_613677
SMILES [H]C12CN(C([H])(C1)CCC2)S(=O)(=O)c1ccc(C)cc1
InChI Key InChIKey=JLWCRSGTBCGNOC-UHFFFAOYSA-N
Data  2 EC50
  Tab Delimited (TSV)   2D SDfile   Computed 3D by Vconf -m prep SDfile
Find this compound or compounds like it in BindingDB:
Activity Spreadsheet -- Enzyme Inhibition Constant Data from BindingDB
Found 2 hits for monomerid = 46984
TargetIon channel NompC(Danio rerio)
The Scripps Research Institute Molecular Screening Center
Curated by PubChem BioAssay
LigandPNGBDBM46984(6-(4-methylphenyl)sulfonyl-6-azabicyclo[3.2.1]octa...)
Affinity DataEC50:  2.99E+4nM. Assay description: Source (MLPCN Center Name): The Scripps Research Institute Molecular Screening Center (SRIMSC) Center Affiliation: The Scripps Research Institute (TS...
In DepthDetails PCBioAssay
TargetMucolipin-3(Homo sapiens (Human))
The Scripps Research Institute Molecular Screening Center
Curated by PubChem BioAssay
LigandPNGBDBM46984(6-(4-methylphenyl)sulfonyl-6-azabicyclo[3.2.1]octa...)
Affinity DataEC50:  3.78E+3nM. Assay description: Source (MLPCN Center Name): The Scripps Research Institute Molecular Screening Center (SRIMSC) Center Affiliation: The Scripps Research Institute (TS...
In DepthDetails PCBioAssay