BDBM469921 CIS-2-[1-(Cyclobutyl-methyl)-8-dimethylamino-2-oxo-8-phenyl-1,3- diazaspiro[4.5]decan-3-yl]-N-(3-hydroxy-pyridin-2-yl)-acetamide::US10807989, Example SC_1151
SMILES CN(C)[C@]1(CC[C@]2(CN(CC(=O)Nc3ncccc3O)C(=O)N2CC2CCC2)CC1)c1ccccc1
InChI Key InChIKey=WVQDYQPVVFNTNE-HNRBIFIRSA-N
Data  2 KI
  Tab Delimited (TSV)   2D SDfile   Computed 3D by Vconf -m prep SDfile
Find this compound or compounds like it in BindingDB:
Activity Spreadsheet -- Enzyme Inhibition Constant Data from BindingDB
Found 2 hits for monomerid = 469921
TargetNociceptin receptor(Homo sapiens (Human))
GrÜNenthal
US Patent
LigandPNGBDBM469921(CIS-2-[1-(Cyclobutyl-methyl)-8-dimethylamino-2-oxo...)
Affinity DataKi:  1.60nM. Assay description: The hNOP receptor binding assay was performed as homogeneous SPA-assay (scintillation proximity assay) using the assay buffer 50 mM TRIS-HCl, 10 mM M...
Ligand InfoPC cidPC sid
In DepthDetails US Patent
TargetMu-type opioid receptor(Homo sapiens (Human))
GrÜNenthal
US Patent
LigandPNGBDBM469921(CIS-2-[1-(Cyclobutyl-methyl)-8-dimethylamino-2-oxo...)
Affinity DataKi:  13.5nM. Assay description: The hMOP receptor binding assay was performed as homogeneous SPA-assay (scintillation proximity assay) using the assay buffer 50 mM TRIS-HCl (pH 7.4)...
Ligand InfoPC cidPC sid
In DepthDetails US Patent