BDBM470043 CIS-8-Dimethylamino-1-[(1-hydroxy-cyclobutyl)-methyl]-3-[2-(4-methylsulfonyl- piperidin-1-yl)-2-oxo-ethyl]-8-phenyl-1,3-diazaspiro[4.5]decan-2-one::US10807989, Example SC_1351
SMILES CN(C)[C@]1(CC[C@]2(CN(CC(=O)N3CCC(CC3)S(C)(=O)=O)C(=O)N2CC2(O)CCC2)CC1)c1ccccc1
InChI Key InChIKey=VIUFXOAYKWUCRY-JSEFLNQRSA-N
Data  2 KI
  Tab Delimited (TSV)   2D SDfile   Computed 3D by Vconf -m prep SDfile
Find this compound or compounds like it in BindingDB:
Activity Spreadsheet -- Enzyme Inhibition Constant Data from BindingDB
Found 2 hits for monomerid = 470043
TargetNociceptin receptor(Homo sapiens (Human))
GrÜNenthal
US Patent
LigandPNGBDBM470043(CIS-8-Dimethylamino-1-[(1-hydroxy-cyclobutyl)-meth...)
Affinity DataKi:  1nM. Assay description: The hNOP receptor binding assay was performed as homogeneous SPA-assay (scintillation proximity assay) using the assay buffer 50 mM TRIS-HCl, 10 mM M...
Ligand InfoPC cidPC sid
In DepthDetails US Patent
TargetMu-type opioid receptor(Homo sapiens (Human))
GrÜNenthal
US Patent
LigandPNGBDBM470043(CIS-8-Dimethylamino-1-[(1-hydroxy-cyclobutyl)-meth...)
Affinity DataKi:  235nM. Assay description: The hMOP receptor binding assay was performed as homogeneous SPA-assay (scintillation proximity assay) using the assay buffer 50 mM TRIS-HCl (pH 7.4)...
Ligand InfoPC cidPC sid
In DepthDetails US Patent