BDBM47007 4-[[4-(2,4-dihydroxyphenyl)-1,3-thiazol-2-yl]amino]benzonitrile::4-[[4-(2,4-dihydroxyphenyl)-2-thiazolyl]amino]benzonitrile::4-[[4-(2,4-dihydroxyphenyl)thiazol-2-yl]amino]benzonitrile::4-[[4-[2,4-bis(oxidanyl)phenyl]-1,3-thiazol-2-yl]amino]benzenecarbonitrile::SR-03000000226-1::cid_25110136
SMILES Oc1ccc(-c2csc(Nc3ccc(cc3)C#N)n2)c(O)c1
InChI Key InChIKey=ZNZZJRAEDVNPRQ-UHFFFAOYSA-N
Data  1 IC50
  Tab Delimited (TSV)   2D SDfile   Computed 3D by Vconf -m prep SDfile
Find this compound or compounds like it in BindingDB:
Activity Spreadsheet -- Enzyme Inhibition Constant Data from BindingDB
Found 1 hit for monomerid = 47007
TargetTransitional endoplasmic reticulum ATPase(Homo sapiens (Human))
The Scripps Research Institute Molecular Screening Center
Curated by PubChem BioAssay
LigandPNGBDBM47007(4-[[4-(2,4-dihydroxyphenyl)-1,3-thiazol-2-yl]amino...)
Affinity DataIC50: >5.00E+4nM. Assay description: Source (MLPCN Center Name): The Scripps Research Institute Molecular Screening Center (SRIMSC) Center Affiliation: The Scripps Research Institute (TS...
In DepthDetails PCBioAssay