BDBM470076 US10807993, Example 15
SMILES CC1(C)Oc2ccc(Cl)cc2C2OCC3(CCN(CC3)C(=O)Cn3ccnc3CO)CC12
InChI Key InChIKey=IOXNMJRBYAMCQG-UHFFFAOYSA-N
Data  1 IC50
  Tab Delimited (TSV)   2D SDfile   Computed 3D by Vconf -m prep SDfile
Find this compound or compounds like it in BindingDB:
Activity Spreadsheet -- Enzyme Inhibition Constant Data from BindingDB
Found 1 hit for monomerid = 470076
TargetPotassium voltage-gated channel subfamily H member 2(Homo sapiens (Human))
Sumitomo Dainippon Pharma
US Patent
LigandPNGBDBM470076(US10807993, Example 15)
Affinity DataIC50:  1.60E+3nM. Assay description: To a cultured CHO cell strain which stably expresses hERG was added each test compound to adjust the final concentration of DMSO to 0.0135 to 0.5%. T...
Ligand InfoPC cidPC sid
In DepthDetails US Patent