BDBM470082 US10807993, Example 21::US10807993, Example 22::US10807993, Example 23
SMILES Cc1nc[nH]c1CN1CC[C@@]2(CC1)COC1C(C2)C(C)(C)Oc2ccc(F)cc12
InChI Key
Data  3 IC50
  Tab Delimited (TSV)   2D SDfile   Computed 3D by Vconf -m prep SDfile
Find this compound or compounds like it in BindingDB:
Activity Spreadsheet -- Enzyme Inhibition Constant Data from BindingDB
Found 3 hits for monomerid = 470082
TargetPotassium voltage-gated channel subfamily H member 2(Homo sapiens (Human))
Sumitomo Dainippon Pharma
US Patent
LigandPNGBDBM470082(US10807993, Example 21 | US10807993, Example 22 | ...)
Affinity DataIC50:  1.50E+3nM. Assay description: To a cultured CHO cell strain which stably expresses hERG was added each test compound to adjust the final concentration of DMSO to 0.0135 to 0.5%. T...
Ligand InfoPC cidPC sid
In DepthDetails US Patent
TargetPotassium voltage-gated channel subfamily H member 2(Homo sapiens (Human))
Sumitomo Dainippon Pharma
US Patent
LigandPNGBDBM470082(US10807993, Example 21 | US10807993, Example 22 | ...)
Affinity DataIC50:  1.40E+3nM. Assay description: To a cultured CHO cell strain which stably expresses hERG was added each test compound to adjust the final concentration of DMSO to 0.0135 to 0.5%. T...
Ligand InfoPC cidPC sid
In DepthDetails US Patent
TargetPotassium voltage-gated channel subfamily H member 2(Homo sapiens (Human))
Sumitomo Dainippon Pharma
US Patent
LigandPNGBDBM470082(US10807993, Example 21 | US10807993, Example 22 | ...)
Affinity DataIC50:  1.60E+3nM. Assay description: To a cultured CHO cell strain which stably expresses hERG was added each test compound to adjust the final concentration of DMSO to 0.0135 to 0.5%. T...
Ligand InfoPC cidPC sid
In DepthDetails US Patent