BDBM470088 US10807993, Example 27
SMILES Cc1nc[nH]c1CN1CCC2(CC1)COC1C(C2)C(C)(C)Oc2c(Cl)cccc12
InChI Key
Data  1 IC50
  Tab Delimited (TSV)   2D SDfile   Computed 3D by Vconf -m prep SDfile
Find this compound or compounds like it in BindingDB:
Activity Spreadsheet -- Enzyme Inhibition Constant Data from BindingDB
Found 1 hit for monomerid = 470088
TargetPotassium voltage-gated channel subfamily H member 2(Homo sapiens (Human))
Sumitomo Dainippon Pharma
US Patent
LigandPNGBDBM470088(US10807993, Example 27)
Affinity DataIC50:  400nM. Assay description: To a cultured CHO cell strain which stably expresses hERG was added each test compound to adjust the final concentration of DMSO to 0.0135 to 0.5%. T...
Ligand InfoPC cidPC sid
In DepthDetails US Patent