BDBM47016 (E)-2-cyano-3-(4-fluoro-2-nitro-phenyl)acrylic acid ethyl ester::(E)-2-cyano-3-(4-fluoro-2-nitrophenyl)-2-propenoic acid ethyl ester::SR-03000000244-1::cid_25110148::ethyl (E)-2-cyano-3-(4-fluoranyl-2-nitro-phenyl)prop-2-enoate::ethyl (E)-2-cyano-3-(4-fluoro-2-nitrophenyl)prop-2-enoate
SMILES CCOC(=O)C(=C\c1ccc(F)cc1[N+]([O-])=O)\C#N
InChI Key InChIKey=GTFQTRUQMFWXGC-WEVVVXLNSA-N
Data  1 IC50
  Tab Delimited (TSV)   2D SDfile   Computed 3D by Vconf -m prep SDfile
Find this compound or compounds like it in BindingDB:
Activity Spreadsheet -- Enzyme Inhibition Constant Data from BindingDB
Found 1 hit for monomerid = 47016
TargetTransitional endoplasmic reticulum ATPase(Homo sapiens (Human))
The Scripps Research Institute Molecular Screening Center
Curated by PubChem BioAssay
LigandPNGBDBM47016((E)-2-cyano-3-(4-fluoro-2-nitro-phenyl)acrylic aci...)
Affinity DataIC50: >5.00E+4nM. Assay description: Source (MLPCN Center Name): The Scripps Research Institute Molecular Screening Center (SRIMSC) Center Affiliation: The Scripps Research Institute (TS...
Ligand InfoPC cidPC sid
In DepthDetails PCBioAssay