BDBM470179 US10807994, Compound 1.55::US10807994, Example S-55
SMILES Clc1cccc(Cl)c1N1COc2nc(Nc3ccc(N4CCNCC4)c(c3)C#N)ncc2C1=O
InChI Key InChIKey=ACJSCQHBMDDSBG-UHFFFAOYSA-N
Data  1 IC50
  Tab Delimited (TSV)   2D SDfile   Computed 3D by Vconf -m prep SDfile
Find this compound or compounds like it in BindingDB:
Activity Spreadsheet -- Enzyme Inhibition Constant Data from BindingDB
Found 1 hit for monomerid = 470179
TargetWee1-like protein kinase(Homo sapiens (Human))
Nuvation Bio
US Patent
LigandPNGBDBM470179(US10807994, Compound 1.55 | US10807994, Example S-...)
Affinity DataIC50:  106nM. Assay description: IC50 values of compounds against WEE1 kinase enzyme were determined by LanthaScreen™ Terbium Labeled TR-FRET assay. Kinase assays were performed in 1...
Ligand InfoPC cidPC sid
In DepthDetails US Patent