BDBM470219 US10807994, Compound 1.244::US10807994, Example S-96
SMILES CC1CN(CCN1)c1ccc(Nc2ncc3C(=O)N(CSc3n2)c2c(Cl)cccc2Cl)cc1Cl
InChI Key InChIKey=HYEGARHVTAPDJH-UHFFFAOYSA-N
Data  1 IC50
  Tab Delimited (TSV)   2D SDfile   Computed 3D by Vconf -m prep SDfile
Find this compound or compounds like it in BindingDB:
Activity Spreadsheet -- Enzyme Inhibition Constant Data from BindingDB
Found 1 hit for monomerid = 470219
TargetWee1-like protein kinase(Homo sapiens (Human))
Nuvation Bio
US Patent
LigandPNGBDBM470219(US10807994, Compound 1.244 | US10807994, Example S...)
Affinity DataIC50:  351nM. Assay description: IC50 values of compounds against WEE1 kinase enzyme were determined by LanthaScreen™ Terbium Labeled TR-FRET assay. Kinase assays were performed in 1...
Ligand InfoPC cidPC sid
In DepthDetails US Patent