BDBM470267 US10815206, Compound I-46
SMILES CN1c2cc(CN3CCn4c(C3)nnc4C(F)(F)F)ccc2OC[C@H](NC(=O)c2nnc(Cc3ccccc3)n2)C1=O
InChI Key
Data  1 IC50
  Tab Delimited (TSV)   2D SDfile   Computed 3D by Vconf -m prep SDfile
Find this compound or compounds like it in BindingDB:
Activity Spreadsheet -- Enzyme Inhibition Constant Data from BindingDB
Found 1 hit for monomerid = 470267
TargetReceptor-interacting serine/threonine-protein kinase 1(Homo sapiens (Human))
Rigel Pharmaceuticals
US Patent
LigandPNGBDBM470267(US10815206, Compound I-46)
Affinity DataIC50:  43.7nM. Assay description: A 500 ml stock volume of 5× Reaction Kinase Buffer was made by mixing 1000 μl of 1M MgCl2, 500 μl of 1M Tris-HCL pH7.4, 0.5 mg/ml (25 mg) o...
Ligand InfoPC cidPC sid
In DepthDetails US Patent