BDBM470291 US10815206, Compound I-74
SMILES CN1c2cc(ccc2OC[C@H](NC(=O)c2n[nH]c(Cc3ccccc3)n2)C1=O)C#C[C@@]1(O)COC2[C@H](COC12)OC(=O)c1ccccc1
InChI Key
Data  1 IC50
  Tab Delimited (TSV)   2D SDfile   Computed 3D by Vconf -m prep SDfile
Find this compound or compounds like it in BindingDB:
Activity Spreadsheet -- Enzyme Inhibition Constant Data from BindingDB
Found 1 hit for monomerid = 470291
TargetReceptor-interacting serine/threonine-protein kinase 1(Homo sapiens (Human))
Rigel Pharmaceuticals
US Patent
LigandPNGBDBM470291(US10815206, Compound I-74)
Affinity DataIC50:  51.8nM. Assay description: A 500 ml stock volume of 5× Reaction Kinase Buffer was made by mixing 1000 μl of 1M MgCl2, 500 μl of 1M Tris-HCL pH7.4, 0.5 mg/ml (25 mg) o...
Ligand InfoPC cidPC sid
In DepthDetails US Patent