BDBM470314 N-(3-{7-[1-(2-Cyano-1-cyclopropylethyl)-1H-pyrazol-4-yl]imidazo[1,2-b]pyridazin-3-yl}phenyl)-N′-(2,2,2-trifluoroethyl)urea::US10813930, Ex. No. 92
SMILES FC(F)(F)CNC(=O)Nc1cccc(c1)-c1cnc2cc(cnn12)C(\C=N)=C\NC(CC#N)C1CC1
InChI Key InChIKey=ABNQDAUBTXDWPG-KEUGJKKOSA-N
Data  1 IC50
  Tab Delimited (TSV)   2D SDfile   Computed 3D by Vconf -m prep SDfile
Find this compound or compounds like it in BindingDB:
Activity Spreadsheet -- Enzyme Inhibition Constant Data from BindingDB
Found 1 hit for monomerid = 470314
TargetFibroblast growth factor receptor 3(Homo sapiens (Human))
Incyte
US Patent
LigandPNGBDBM470314(N-(3-{7-[1-(2-Cyano-1-cyclopropylethyl)-1H-pyrazol...)
Affinity DataIC50: <10nM. Assay description: FGFR3 Enzymatic Assay The inhibitor potency of compounds of the invention was measured in an enzyme assay that measures peptide phosphorylation using...
Ligand InfoPC cidPC sid
In DepthDetails US Patent