BDBM470320 US10815206, Compound I-88::US11332451, Compound I-88::US11370764, Compound I-88::US11377428, Compound I-88
SMILES CN1c2cc(ccc2OC[C@H](NC(=O)c2n[nH]c(Cc3ccccc3)n2)C1=O)C#Cc1ccc2CCNCc2c1
InChI Key
Data  4 IC50
  Tab Delimited (TSV)   2D SDfile   Computed 3D by Vconf -m prep SDfile
Find this compound or compounds like it in BindingDB:
Activity Spreadsheet -- Enzyme Inhibition Constant Data from BindingDB
Found 4 hits for monomerid = 470320
TargetReceptor-interacting serine/threonine-protein kinase 1(Homo sapiens (Human))
Rigel Pharmaceuticals
US Patent
LigandPNGBDBM470320(US10815206, Compound I-88 | US11332451, Compound I...)
Affinity DataIC50:  73.8nM. Assay description: A 500 ml stock volume of 5× Reaction Kinase Buffer was made by mixing 1000 μl of 1M MgCl2, 500 μl of 1M Tris-HCL pH7.4, 0.5 mg/ml (25 mg) o...
Ligand InfoPC cidPC sid
In DepthDetails US Patent
TargetReceptor-interacting serine/threonine-protein kinase 1(Homo sapiens (Human))
Rigel Pharmaceuticals
US Patent
LigandPNGBDBM470320(US10815206, Compound I-88 | US11332451, Compound I...)
Affinity DataIC50:  73.8nM. Assay description: A 500 ml stock volume of 5× Reaction Kinase Buffer was made by mixing 1000 μl of 1M MgCl2, 500 μl of 1M Tris-HCL pH7.4, 0.5 mg/ml (25 mg) o...
Ligand InfoPC cidPC sid
In DepthDetails US Patent
TargetReceptor-interacting serine/threonine-protein kinase 1(Homo sapiens (Human))
Rigel Pharmaceuticals
US Patent
LigandPNGBDBM470320(US10815206, Compound I-88 | US11332451, Compound I...)
Affinity DataIC50:  73.8nM. Assay description: ADP-Glo (Promega, Madison, Wis., USA) reagents were thawed at ambient temperature. Kinase Detection Reagent was prepared by mixing kinase detection b...
Ligand InfoPC cidPC sid
In DepthDetails US Patent
TargetReceptor-interacting serine/threonine-protein kinase 1(Homo sapiens (Human))
Rigel Pharmaceuticals
US Patent
LigandPNGBDBM470320(US10815206, Compound I-88 | US11332451, Compound I...)
Affinity DataIC50:  73.8nM. Assay description: A 500 ml stock volume of 5× Reaction Kinase Buffer was made by mixing 1000 μl of 1M MgCl2, 500 μl of 1M Tris-HCL pH7.4, 0.5 mg/ml (25 mg) o...
Ligand InfoPC cidPC sid
In DepthDetails US Patent