BDBM470478 5-fluoro-N-(2-fluoro-6-methylphenyl)-4-[3-(hydroxymethyl)-4-methyl-5-oxo-4,5-dihydro-1H-1,2,4-triazol-1-yl]-2-[(2S)-pentan-2-yloxy]benzamide::US10815215, Example 141::US11130745, Example 141::US11713304, Example 141
SMILES CCC[C@H](C)Oc1cc(c(F)cc1C(=O)Nc1c(C)cccc1F)-n1nc(CO)n(C)c1=O
InChI Key InChIKey=MVDYKZWLDQLEEY-AWEZNQCLSA-N
Data  3 IC50
  Tab Delimited (TSV)   2D SDfile   Computed 3D by Vconf -m prep SDfile
Find this compound or compounds like it in BindingDB:
Activity Spreadsheet -- Enzyme Inhibition Constant Data from BindingDB
Found 3 hits for monomerid = 470478
TargetDihydroorotate dehydrogenase (quinone), mitochondrial(Homo sapiens (Human))
Bayer Aktiengesellschaft
US Patent
LigandPNGBDBM470478(5-fluoro-N-(2-fluoro-6-methylphenyl)-4-[3-(hydroxy...)
Affinity DataIC50:  7.5nM. Assay description: Assay 1: The enzymatic assay couples DHODH activity with bleaching of the dye 2,6-dichlorophenolindophenol (DCIP) (Knecht and Loffler, 1998; Miller e...
Ligand InfoPC cidPC sid
In DepthDetails US Patent
TargetDihydroorotate dehydrogenase (quinone), mitochondrial(Homo sapiens (Human))
Bayer Aktiengesellschaft
US Patent
LigandPNGBDBM470478(5-fluoro-N-(2-fluoro-6-methylphenyl)-4-[3-(hydroxy...)
Affinity DataIC50:  7.5nM. Assay description: DHODH enzymatic assay 1: The enzymatic assay couples DHODH activity with bleaching of the dye 2,6-dichlorophenolindophenol (DCIP) (Knecht and Loffler...
Ligand InfoPC cidPC sid
In DepthDetails US Patent
TargetDihydroorotate dehydrogenase (quinone), mitochondrial(Homo sapiens (Human))
Bayer Aktiengesellschaft
US Patent
LigandPNGBDBM470478(5-fluoro-N-(2-fluoro-6-methylphenyl)-4-[3-(hydroxy...)
Affinity DataIC50:  7.5nM. Assay description: The enzymatic assay couples DHODH activity with bleaching of the dye 2,6-dichlorophenolindophenol (DCIP) (Knecht and Loffler, 1998; Miller et al., 19...
Ligand InfoPC cidPC sid
In DepthDetails US Patent