BDBM470555 1-(4-[(2,6-dichlorophenyl)carbamoyl]-2-fluoro-5-{[(2S)-1,1,1-trifluoropropan-2-yl]oxy}phenyl)-4-ethyl-5-oxo-4,5-dihydro-1H-1,2,4-triazole-3-carboxylic acid::US10815215, Example 215::US11130745, Example 215::US11713304, Example 215
SMILES CCn1c(nn(-c2cc(O[C@@H](C)C(F)(F)F)c(cc2F)C(=O)Nc2c(Cl)cccc2Cl)c1=O)C(O)=O
InChI Key InChIKey=BSJRKIOZGYTFKG-VIFPVBQESA-N
Data  3 IC50
  Tab Delimited (TSV)   2D SDfile   Computed 3D by Vconf -m prep SDfile
Find this compound or compounds like it in BindingDB:
Activity Spreadsheet -- Enzyme Inhibition Constant Data from BindingDB
Found 3 hits for monomerid = 470555
TargetDihydroorotate dehydrogenase (quinone), mitochondrial(Homo sapiens (Human))
Bayer Aktiengesellschaft
US Patent
LigandPNGBDBM470555(1-(4-[(2,6-dichlorophenyl)carbamoyl]-2-fluoro-5-{[...)
Affinity DataIC50:  1.5nM. Assay description: Assay 1: The enzymatic assay couples DHODH activity with bleaching of the dye 2,6-dichlorophenolindophenol (DCIP) (Knecht and Loffler, 1998; Miller e...
Ligand InfoPC cidPC sid
In DepthDetails US Patent
TargetDihydroorotate dehydrogenase (quinone), mitochondrial(Homo sapiens (Human))
Bayer Aktiengesellschaft
US Patent
LigandPNGBDBM470555(1-(4-[(2,6-dichlorophenyl)carbamoyl]-2-fluoro-5-{[...)
Affinity DataIC50:  1.5nM. Assay description: DHODH enzymatic assay 1: The enzymatic assay couples DHODH activity with bleaching of the dye 2,6-dichlorophenolindophenol (DCIP) (Knecht and Loffler...
Ligand InfoPC cidPC sid
In DepthDetails US Patent
TargetDihydroorotate dehydrogenase (quinone), mitochondrial(Homo sapiens (Human))
Bayer Aktiengesellschaft
US Patent
LigandPNGBDBM470555(1-(4-[(2,6-dichlorophenyl)carbamoyl]-2-fluoro-5-{[...)
Affinity DataIC50:  1.5nM. Assay description: The enzymatic assay couples DHODH activity with bleaching of the dye 2,6-dichlorophenolindophenol (DCIP) (Knecht and Loffler, 1998; Miller et al., 19...
Ligand InfoPC cidPC sid
In DepthDetails US Patent