BDBM470558 1-(4-[(2-chloro-6-fluorophenyl)carbamoyl]-2-fluoro-5-{[(2S)-1,1,1-trifluoropropan-2-yl]oxy}phenyl)-4-methyl-5-oxo-4,5-dihydro-1H-1,2,4-triazole-3-carboxylic acid::US10815215, Example 218::US11130745, Example 218::US11713304, Example 218
SMILES C[C@H](Oc1cc(c(F)cc1C(=O)Nc1c(F)cccc1Cl)-n1nc(C(O)=O)n(C)c1=O)C(F)(F)F
InChI Key InChIKey=BPNKVHXZDJTPOT-QMMMGPOBSA-N
Data  3 IC50
  Tab Delimited (TSV)   2D SDfile   Computed 3D by Vconf -m prep SDfile
Find this compound or compounds like it in BindingDB:
Activity Spreadsheet -- Enzyme Inhibition Constant Data from BindingDB
Found 3 hits for monomerid = 470558
TargetDihydroorotate dehydrogenase (quinone), mitochondrial(Homo sapiens (Human))
Bayer Aktiengesellschaft
US Patent
LigandPNGBDBM470558(1-(4-[(2-chloro-6-fluorophenyl)carbamoyl]-2-fluoro...)
Affinity DataIC50:  6.5nM. Assay description: Assay 1: The enzymatic assay couples DHODH activity with bleaching of the dye 2,6-dichlorophenolindophenol (DCIP) (Knecht and Loffler, 1998; Miller e...
Ligand InfoPC cidPC sid
In DepthDetails US Patent
TargetDihydroorotate dehydrogenase (quinone), mitochondrial(Homo sapiens (Human))
Bayer Aktiengesellschaft
US Patent
LigandPNGBDBM470558(1-(4-[(2-chloro-6-fluorophenyl)carbamoyl]-2-fluoro...)
Affinity DataIC50:  6.5nM. Assay description: DHODH enzymatic assay 1: The enzymatic assay couples DHODH activity with bleaching of the dye 2,6-dichlorophenolindophenol (DCIP) (Knecht and Loffler...
Ligand InfoPC cidPC sid
In DepthDetails US Patent
TargetDihydroorotate dehydrogenase (quinone), mitochondrial(Homo sapiens (Human))
Bayer Aktiengesellschaft
US Patent
LigandPNGBDBM470558(1-(4-[(2-chloro-6-fluorophenyl)carbamoyl]-2-fluoro...)
Affinity DataIC50:  6.5nM. Assay description: The enzymatic assay couples DHODH activity with bleaching of the dye 2,6-dichlorophenolindophenol (DCIP) (Knecht and Loffler, 1998; Miller et al., 19...
Ligand InfoPC cidPC sid
In DepthDetails US Patent