BDBM47058 3-(1-benzofuran-2-carbonyl)-1-[3-(diethylamino)propyl]-4-hydroxy-2-pyridin-2-yl-2H-pyrrol-5-one::3-(1-benzofuran-2-ylcarbonyl)-1-[3-(diethylamino)propyl]-4-oxidanyl-2-pyridin-2-yl-2H-pyrrol-5-one::3-[2-benzofuranyl(oxo)methyl]-1-[3-(diethylamino)propyl]-4-hydroxy-2-(2-pyridinyl)-2H-pyrrol-5-one::4-(benzofuran-2-carbonyl)-1-[3-(diethylamino)propyl]-3-hydroxy-5-(2-pyridyl)-3-pyrrolin-2-one::MLS000081280::SMR000042600::cid_661982
SMILES CCN(CC)CCCN1C(C(C(=O)c2cc3ccccc3o2)C(=O)C1=O)c1ccccn1
InChI Key InChIKey=ICROROLWTFDWNZ-UHFFFAOYSA-N
Data  2 IC50
  Tab Delimited (TSV)   2D SDfile   Computed 3D by Vconf -m prep SDfile
Find this compound or compounds like it in BindingDB:
Activity Spreadsheet -- Enzyme Inhibition Constant Data from BindingDB
Found 2 hits for monomerid = 47058
TargetIsoform 2 of Nuclear receptor corepressor 2 (TRAC-1)(Homo sapiens (Human))
The Scripps Research Institute Molecular Screening Center
Curated by PubChem BioAssay
LigandPNGBDBM47058(3-(1-benzofuran-2-carbonyl)-1-[3-(diethylamino)pro...)
Affinity DataIC50:  4.13E+3nM. Assay description: Source (MLPCN Center Name): The Scripps Research Institute Molecular Screening Center Affiliation: The Scripps Research Institute, TSRI Assay Provide...
In DepthDetails PCBioAssay
TargetPhotoreceptor-specific nuclear receptor(Homo sapiens (Human))
The Scripps Research Institute Molecular Screening Center
Curated by PubChem BioAssay
LigandPNGBDBM47058(3-(1-benzofuran-2-carbonyl)-1-[3-(diethylamino)pro...)
Affinity DataIC50: >3.98E+4nM. Assay description: Source (MLPCN Center Name): The Scripps Research Institute Molecular Screening Center Affiliation: The Scripps Research Institute, TSRI Assay Provide...
In DepthDetails PCBioAssay