BDBM470582 US10815241, Example 7::US11369605, Example 7
SMILES CC(C)N(C(C)C)C(=O)c1cc(F)ccc1Oc1cncnc1N1CC2(CN(C2)C(=O)[C@H]2N[C@H]3CC[C@@H]2C(=C)C3)C1
InChI Key InChIKey=PCKBGGHSHIIDPV-OBTVHEKISA-N
Data  2 IC50
  Tab Delimited (TSV)   2D SDfile   Computed 3D by Vconf -m prep SDfile
Find this compound or compounds like it in BindingDB:
Activity Spreadsheet -- Enzyme Inhibition Constant Data from BindingDB
Found 2 hits for monomerid = 470582
TargetHistone-lysine N-methyltransferase 2A/Menin(Homo sapiens (Human))
Sumitomo Dainippon Pharma
US Patent
LigandPNGBDBM470582(US10815241, Example 7 | US11369605, Example 7)
Affinity DataIC50: <3nM. Assay description: Menin1-615 wherein 6×His tag and HA tag are inserted in the N-terminus, and myc tag is inserted in the C-terminus (hereinafter, referred to as His-Me...
Ligand InfoPC cidPC sid
In DepthDetails US Patent
TargetMenin(Homo sapiens (Human))
Sumitomo Dainippon Pharma
US Patent
LigandPNGBDBM470582(US10815241, Example 7 | US11369605, Example 7)
Affinity DataIC50: <3nM. Assay description: Menin1-615 wherein 6×His tag and HA tag are inserted in the N-terminus, and myc tag is inserted in the C-terminus (hereinafter, referred to as His-Me...
Ligand InfoPC cidPC sid
In DepthDetails US Patent