BDBM470603 US10821115, Example 7::US11224601, Example 7
SMILES C[C@H]1CCC[C@@](O)(CN2CCN3CCOC[C@@H]3C2)[C@@H]2CC[C@H]2CN2C[C@@]3(CCCc4cc(Cl)ccc34)COc3ccc(cc23)C(=O)NS(=O)(=O)[C@@H]1C
InChI Key InChIKey=XBJACBQKKITLOT-ACNJYMHISA-N
Data  2 IC50
  Tab Delimited (TSV)   2D SDfile   Computed 3D by Vconf -m prep SDfile
Find this compound or compounds like it in BindingDB:
Activity Spreadsheet -- Enzyme Inhibition Constant Data from BindingDB
Found 2 hits for monomerid = 470603
LigandPNGBDBM470603(US10821115, Example 7 | US11224601, Example 7)
Affinity DataIC50:  0.0580nM. Assay description: The inhibition of the Mcl-1/Bim interaction was measured using a time-resolved fluorescence resonance energy transfer (TR-FRET) assay. The recombinan...
Ligand InfoPC cidPC sid
In DepthDetails US Patent
LigandPNGBDBM470603(US10821115, Example 7 | US11224601, Example 7)
Affinity DataIC50:  0.0580nM. Assay description: The inhibition of the Mcl-1/Bim interaction was measured using a time-resolved fluorescence resonance energy transfer (TR-FRET) assay. The recombinan...
Ligand InfoPC cidPC sid
In DepthDetails US Patent