BDBM470828 (1S,3''R,6''R,7''S,8''E,11''S,12''R)- 7''-(((9aS)-8-acetyloctahydro- 2H-pyrazino[1,2-a]pyrazin-2- yl)methyl)-6-chloro-7''- methoxy-11'',12''-dimethyl-3,4- dihydro-2H,15''H- spiro[naphthalene-1,22''- [20]oxa[13]thia[1,14] diazatetracyclo [14.7.2.0~3,6~.0~19''24~] pentacosa[8,16,18,24]tetraen]- 15''-one 13'',13''-dioxide::US10821115, Example 214::US10821115, Example 225::US10821115, Example 226::US11224601, Example 226
SMILES CO[C@@]1(CN2CCN3CCN(C[C@@H]3C2)C(C)=O)\C=C\C[C@H](C)[C@@H](C)S(=O)(=O)NC(=O)c2ccc3OC[C@]4(CCCc5cc(Cl)ccc45)CN(C[C@@H]4CC[C@@H]14)c3c2
InChI Key InChIKey=UZIPFCZITGTKOC-KFFYDVBDSA-N
Data  6 IC50
  Tab Delimited (TSV)   2D SDfile   Computed 3D by Vconf -m prep SDfile
Find this compound or compounds like it in BindingDB:
Activity Spreadsheet -- Enzyme Inhibition Constant Data from BindingDB
Found 6 hits for monomerid = 470828
LigandPNGBDBM470828((1S,3''R,6''R,7''S,8''E,11''S,12''R)- 7''-(((9aS)-...)
Affinity DataIC50:  0.0710nM. Assay description: The inhibition of the Mcl-1/Bim interaction was measured using a time-resolved fluorescence resonance energy transfer (TR-FRET) assay. The recombinan...
Ligand InfoPC cidPC sid
In DepthDetails US Patent
LigandPNGBDBM470828((1S,3''R,6''R,7''S,8''E,11''S,12''R)- 7''-(((9aS)-...)
Affinity DataIC50:  0.0870nM. Assay description: The inhibition of the Mcl-1/Bim interaction was measured using a time-resolved fluorescence resonance energy transfer (TR-FRET) assay. The recombinan...
Ligand InfoPC cidPC sid
In DepthDetails US Patent
LigandPNGBDBM470828((1S,3''R,6''R,7''S,8''E,11''S,12''R)- 7''-(((9aS)-...)
Affinity DataIC50:  0.0570nM. Assay description: The inhibition of the Mcl-1/Bim interaction was measured using a time-resolved fluorescence resonance energy transfer (TR-FRET) assay. The recombinan...
Ligand InfoPC cidPC sid
In DepthDetails US Patent
LigandPNGBDBM470828((1S,3''R,6''R,7''S,8''E,11''S,12''R)- 7''-(((9aS)-...)
Affinity DataIC50:  0.0710nM. Assay description: The inhibition of the Mcl-1/Bim interaction was measured using a time-resolved fluorescence resonance energy transfer (TR-FRET) assay. The recombinan...
Ligand InfoPC cidPC sid
In DepthDetails US Patent
LigandPNGBDBM470828((1S,3''R,6''R,7''S,8''E,11''S,12''R)- 7''-(((9aS)-...)
Affinity DataIC50:  0.0870nM. Assay description: The inhibition of the Mcl-1/Bim interaction was measured using a time-resolved fluorescence resonance energy transfer (TR-FRET) assay. The recombinan...
Ligand InfoPC cidPC sid
In DepthDetails US Patent
LigandPNGBDBM470828((1S,3''R,6''R,7''S,8''E,11''S,12''R)- 7''-(((9aS)-...)
Affinity DataIC50:  0.0570nM. Assay description: The inhibition of the Mcl-1/Bim interaction was measured using a time-resolved fluorescence resonance energy transfer (TR-FRET) assay. The recombinan...
Ligand InfoPC cidPC sid
In DepthDetails US Patent