BDBM471007 US10821115, Example 100020::US10821115, Example 100293::US11224601, Example 100293
SMILES C[C@H]1C\C=C\[C@@](O)(CS(=O)(=O)N(C)C)[C@@H]2CC[C@H]2CN2C[C@@]3(CCCc4cc(Cl)ccc34)COc3ccc(cc23)C(=O)NS(=O)(=O)[C@@H]1C
InChI Key InChIKey=CRRFJZUZGLKIIF-FCOKFUSHSA-N
Data  4 IC50
  Tab Delimited (TSV)   2D SDfile   Computed 3D by Vconf -m prep SDfile
Find this compound or compounds like it in BindingDB:
Activity Spreadsheet -- Enzyme Inhibition Constant Data from BindingDB
Found 4 hits for monomerid = 471007
LigandPNGBDBM471007(US10821115, Example 100020 | US10821115, Example 1...)
Affinity DataIC50:  0.0320nM. Assay description: The inhibition of the Mcl-1/Bim interaction was measured using a time-resolved fluorescence resonance energy transfer (TR-FRET) assay. The recombinan...
Ligand InfoPC cidPC sid
In DepthDetails US Patent
LigandPNGBDBM471007(US10821115, Example 100020 | US10821115, Example 1...)
Affinity DataIC50:  0.522nM. Assay description: The inhibition of the Mcl-1/Bim interaction was measured using a time-resolved fluorescence resonance energy transfer (TR-FRET) assay. The recombinan...
Ligand InfoPC cidPC sid
In DepthDetails US Patent
LigandPNGBDBM471007(US10821115, Example 100020 | US10821115, Example 1...)
Affinity DataIC50:  0.0320nM. Assay description: The inhibition of the Mcl-1/Bim interaction was measured using a time-resolved fluorescence resonance energy transfer (TR-FRET) assay. The recombinan...
Ligand InfoPC cidPC sid
In DepthDetails US Patent
LigandPNGBDBM471007(US10821115, Example 100020 | US10821115, Example 1...)
Affinity DataIC50:  0.522nM. Assay description: The inhibition of the Mcl-1/Bim interaction was measured using a time-resolved fluorescence resonance energy transfer (TR-FRET) assay. The recombinan...
Ligand InfoPC cidPC sid
In DepthDetails US Patent