BDBM471418 US10821115, Example 100433::US11224601, Example 100433
SMILES C[C@H]1C\C=C\[C@](O)(C#CCC2CCOCC2)[C@@H]2CC[C@H]2CN2C[C@@]3(CCCc4cc(Cl)ccc34)COc3ccc(cc23)C(=O)NS(=O)(=O)[C@@H]1C
InChI Key InChIKey=FRKOBAUYSTVMAC-NGIAPPMUSA-N
Data  2 IC50
  Tab Delimited (TSV)   2D SDfile   Computed 3D by Vconf -m prep SDfile
Find this compound or compounds like it in BindingDB:
Activity Spreadsheet -- Enzyme Inhibition Constant Data from BindingDB
Found 2 hits for monomerid = 471418
LigandPNGBDBM471418(US10821115, Example 100433 | US11224601, Example 1...)
Affinity DataIC50:  0.0260nM. Assay description: The inhibition of the Mcl-1/Bim interaction was measured using a time-resolved fluorescence resonance energy transfer (TR-FRET) assay. The recombinan...
Ligand InfoPC cidPC sid
In DepthDetails US Patent
LigandPNGBDBM471418(US10821115, Example 100433 | US11224601, Example 1...)
Affinity DataIC50:  0.0260nM. Assay description: The inhibition of the Mcl-1/Bim interaction was measured using a time-resolved fluorescence resonance energy transfer (TR-FRET) assay. The recombinan...
Ligand InfoPC cidPC sid
In DepthDetails US Patent