BDBM471606 US10822334, Compound 18
SMILES CN1CCC(Oc2cc(OC3CCOC3)cc3ncnc(Nc4ccc(Oc5ccn6ncnc6c5)c(C)c4)c23)C(F)(F)C1
InChI Key InChIKey=AQJDDFRQEZZVKP-UHFFFAOYSA-N
Data  2 IC50
  Tab Delimited (TSV)   2D SDfile   Computed 3D by Vconf -m prep SDfile
Find this compound or compounds like it in BindingDB:
Activity Spreadsheet -- Enzyme Inhibition Constant Data from BindingDB
Found 2 hits for monomerid = 471606
TargetEpidermal growth factor receptor(Homo sapiens (Human))
TBA
US Patent
LigandPNGBDBM471606(US10822334, Compound 18)
Affinity DataIC50:  515nM. Assay description: EGFR: The compounds' inhibition of target modulation were determined as follows: NCI-H838 cells were sorted in 96 well plates (20000 cells/well) ...
Ligand InfoPC cidPC sid
In DepthDetails US Patent
TargetReceptor tyrosine-protein kinase erbB-2(Homo sapiens (Human))
TBA
US Patent
LigandPNGBDBM471606(US10822334, Compound 18)
Affinity DataIC50:  12.6nM. Assay description: HER2: The compounds' inhibition of target modulation were determined as follows: BT474 cells were sorted in 96 well plates (20000 cells/well) wit...
Ligand InfoPC cidPC sid
In DepthDetails US Patent