BDBM471613 US10822334, Compound 25
SMILES CN1CC[C@@H](C[C@@H]1C(F)(F)F)Oc1cccc2ncnc(Nc3ccc(Oc4ccn5ncnc5c4)c(C)c3)c12
InChI Key InChIKey=SVADEPXNDKFAGJ-YADARESESA-N
Data  2 IC50
  Tab Delimited (TSV)   2D SDfile   Computed 3D by Vconf -m prep SDfile
Find this compound or compounds like it in BindingDB:
Activity Spreadsheet -- Enzyme Inhibition Constant Data from BindingDB
Found 2 hits for monomerid = 471613
TargetEpidermal growth factor receptor(Homo sapiens (Human))
TBA
US Patent
LigandPNGBDBM471613(US10822334, Compound 25)
Affinity DataIC50: >1.00E+4nM. Assay description: EGFR: The compounds' inhibition of target modulation were determined as follows: NCI-H838 cells were sorted in 96 well plates (20000 cells/well) ...
Ligand InfoPC cidPC sid
In DepthDetails US Patent
TargetReceptor tyrosine-protein kinase erbB-2(Homo sapiens (Human))
TBA
US Patent
LigandPNGBDBM471613(US10822334, Compound 25)
Affinity DataIC50:  16.8nM. Assay description: HER2: The compounds' inhibition of target modulation were determined as follows: BT474 cells were sorted in 96 well plates (20000 cells/well) wit...
Ligand InfoPC cidPC sid
In DepthDetails US Patent