BDBM471620 (R)-2-(1-(2,2- difluoroethyl)piperidin-3- yl)-7-methoxy- [1,2,4]triazolo[1,5- c]quinazolin-5-amine::US10822338, Example 3
SMILES COc1cccc2c3nc(nn3c(N)nc12)[C@@H]1CCCN(CC(F)F)C1
InChI Key InChIKey=ZLFLYFMSAXYACA-SNVBAGLBSA-N
Data  1 KI
  Tab Delimited (TSV)   2D SDfile   Computed 3D by Vconf -m prep SDfile
Find this compound or compounds like it in BindingDB:
Activity Spreadsheet -- Enzyme Inhibition Constant Data from BindingDB
Found 1 hit for monomerid = 471620
TargetAdenosine receptor A2a(Homo sapiens (Human))
Merck Sharp & Dohme
US Patent
LigandPNGBDBM471620((R)-2-(1-(2,2- difluoroethyl)piperidin-3- yl)-7-me...)
Affinity DataKi:  0.400nM. Assay description: Binding affinities of compounds of the invention for the human A2A receptor were determined in a competition binding assay using Scintillation Proxim...
Ligand InfoPC cidPC sid
In DepthDetails US Patent