BDBM471637 (R)-2-(1-(1,3,4- thiadiazol-2- yl)piperidin-3-yl)-7- methoxy- [1,2,4]triazolo[1,5- c]quinazolin-5-amine::US10822338, Example 20
SMILES COc1cccc2c3nc(nn3c(N)nc12)[C@@H]1CCCN(C1)c1nncs1
InChI Key InChIKey=BOHSFOBHAOYNNZ-SNVBAGLBSA-N
Data  1 KI
  Tab Delimited (TSV)   2D SDfile   Computed 3D by Vconf -m prep SDfile
Find this compound or compounds like it in BindingDB:
Activity Spreadsheet -- Enzyme Inhibition Constant Data from BindingDB
Found 1 hit for monomerid = 471637
TargetAdenosine receptor A2a(Homo sapiens (Human))
Merck Sharp & Dohme
US Patent
LigandPNGBDBM471637((R)-2-(1-(1,3,4- thiadiazol-2- yl)piperidin-3-yl)-...)
Affinity DataKi:  1.90nM. Assay description: Binding affinities of compounds of the invention for the human A2A receptor were determined in a competition binding assay using Scintillation Proxim...
Ligand InfoPC cidPC sid
In DepthDetails US Patent