BDBM471669 US10822338, Example 42
SMILES COc1cccc2c3nc(nn3c(N)nc12)[C@@H]1CCCN(C1)C(=O)C(C)(C)F
InChI Key InChIKey=QVTUPDNLXZGTES-LLVKDONJSA-N
Data  1 KI
  Tab Delimited (TSV)   2D SDfile   Computed 3D by Vconf -m prep SDfile
Find this compound or compounds like it in BindingDB:
Activity Spreadsheet -- Enzyme Inhibition Constant Data from BindingDB
Found 1 hit for monomerid = 471669
TargetAdenosine receptor A2a(Homo sapiens (Human))
Merck Sharp & Dohme
US Patent
LigandPNGBDBM471669(US10822338, Example 42)
Affinity DataKi:  1.10nM. Assay description: Binding affinities of compounds of the invention for the human A2A receptor were determined in a competition binding assay using Scintillation Proxim...
Ligand InfoPC cidPC sid
In DepthDetails US Patent