BDBM471692 US10822338, Example 35D
SMILES COc1cccc2c3nc(nn3c(N)nc12)[C@@H]1CC2CC[C@H]1N(CC(F)(F)F)C2
InChI Key InChIKey=ZCOWAJONFTZWIN-SKVSWLLESA-N
Data  1 KI
  Tab Delimited (TSV)   2D SDfile   Computed 3D by Vconf -m prep SDfile
Find this compound or compounds like it in BindingDB:
Activity Spreadsheet -- Enzyme Inhibition Constant Data from BindingDB
Found 1 hit for monomerid = 471692
TargetAdenosine receptor A2a(Homo sapiens (Human))
Merck Sharp & Dohme
US Patent
LigandPNGBDBM471692(US10822338, Example 35D)
Affinity DataKi:  9.90nM. Assay description: Binding affinities of compounds of the invention for the human A2A receptor were determined in a competition binding assay using Scintillation Proxim...
Ligand InfoPC cidPC sid
In DepthDetails US Patent