BDBM471703 US10822342, Compound 11
SMILES CCn1cc2nc(N)nc(-c3cn(C4CN(CC5CC5)C4)c4cnc(cc34)C#CC(C)(C)O)c2n1
InChI Key InChIKey=OAYNMSIISGGJKJ-UHFFFAOYSA-N
Data  1 IC50
  Tab Delimited (TSV)   2D SDfile   Computed 3D by Vconf -m prep SDfile
Find this compound or compounds like it in BindingDB:
Activity Spreadsheet -- Enzyme Inhibition Constant Data from BindingDB
Found 1 hit for monomerid = 471703
TargetMitogen-activated protein kinase kinase kinase 14(Homo sapiens (Human))
Janssen Pharmaceutica
US Patent
LigandPNGBDBM471703(US10822342, Compound 11)
Affinity DataIC50:  143nM. Assay description: NIK/MAP3K14 auto-phosphorylation activity was measured using the AlphaScreenŽ (αscreen) format (Perkin Elmer). All compounds tested were dissolv...
Ligand InfoPC cidPC sid
In DepthDetails US Patent